Line 18: error: conio.h: No such file or directory
Line 20: error: process.h: No such file or directory
t.cpp: In member function 'void bank::deposit()':
Line 41: error: no match for 'operator<' in 'std::cout < "\012Enter the sum you want to deposit:"'
compilation terminated due to -Wfatal-errors.